Reaction Details
TargetLysine-specific demethylase 5B
LigandBDBM191599
Substrate/Competitorn/a
Meas. Tech.AlphaLISA Assay
pH7.2±n/a
Temperature298.15±n/a K
IC50 3.3e+2± 3e+1 nM
Commentsextracted
Citation Horton, JRLiu, XGale, MWu, LShanks, JRZhang, XWebber, PJBell, JSKales, SCMott, BTRai, GJansen, DJHenderson, MJUrban, DJHall, MDSimeonov, AMaloney, DJJohns, MAFu, HJadhav, AVertino, PMYan, QCheng, X Structural Basis for KDM5A Histone Lysine Demethylase Inhibition by Diverse Compounds. Cell Chem Biol23:769-81 (2016) 
 
Lysine-specific demethylase 5B
Name:Lysine-specific demethylase 5B
Type:Protein
Mol. Mass.:175659.67
Organism:Homo sapiens (Human)
Description:Q9UGL1
Residue:1544
BDBM191599
NameBDBM191599
Synonyms:KDOAM-21 | ethyl 2-(((2-((2-(dimethylamino)ethyl)(ethyl)amino)-2-oxoethyl)amino)methyl)isonicotinate (KDM5-C70)
TypeSmall organic molecule
Emp. Form.C17H28N4O3
Mol. Mass.336.4292
SMILESCCOC(=O)c1ccnc(CNCC(=O)N(CC)CCN(C)C)c1