Reaction Details
TargetLysine-specific demethylase 5C
LigandBDBM50396019
Substrate/Competitorn/a
Meas. Tech.AlphaLISA Assay
pH7.2±n/a
Temperature298.15±n/a K
IC50 129± 5 nM
Commentsextracted
Citation Horton, JRLiu, XGale, MWu, LShanks, JRZhang, XWebber, PJBell, JSKales, SCMott, BTRai, GJansen, DJHenderson, MJUrban, DJHall, MDSimeonov, AMaloney, DJJohns, MAFu, HJadhav, AVertino, PMYan, QCheng, X Structural Basis for KDM5A Histone Lysine Demethylase Inhibition by Diverse Compounds. Cell Chem Biol23:769-81 (2016) 
 
Lysine-specific demethylase 5C
Name:Lysine-specific demethylase 5C
Type:PROTEIN
Mol. Mass.:175691.17
Organism:Homo sapiens (Human)
Description:P41229
Residue:1560
BDBM50396019
NameBDBM50396019
Synonyms:4'-(phenethylcarbamoyl)-[2,2'-bipyridine]-4-carboxylic acid (N3) | CHEMBL2169917
TypeSmall organic molecule
Emp. Form.C20H17N3O3
Mol. Mass.347.3673
SMILESOC(=O)c1ccnc(c1)-c1cc(ccn1)C(=O)NCCc1ccccc1