Reaction Details
TargetLysine-specific demethylase 5C
LigandBDBM191604
Substrate/Competitorn/a
Meas. Tech.AlphaLISA Assay
pH7.2±n/a
Temperature298.15±n/a K
IC50 3.8e+3± 5e+2 nM
Commentsextracted
Citation Horton, JRLiu, XGale, MWu, LShanks, JRZhang, XWebber, PJBell, JSKales, SCMott, BTRai, GJansen, DJHenderson, MJUrban, DJHall, MDSimeonov, AMaloney, DJJohns, MAFu, HJadhav, AVertino, PMYan, QCheng, X Structural Basis for KDM5A Histone Lysine Demethylase Inhibition by Diverse Compounds. Cell Chem Biol23:769-81 (2016) 
 
Lysine-specific demethylase 5C
Name:Lysine-specific demethylase 5C
Type:PROTEIN
Mol. Mass.:175691.17
Organism:Homo sapiens (Human)
Description:P41229
Residue:1560
BDBM191604
NameBDBM191604
Synonyms:8-(1-methyl-1Himidazol-4-yl)-2-(4,4,4-trifluorobutoxy)pyrido[3,4-d]pyrimidin-4-ol (N10)
TypeSmall organic molecule
Emp. Form.C15H14F3N5O2
Mol. Mass.353.2992
SMILESCn1cnc(c1)-c1nccc2c(O)nc(OCCCC(F)(F)F)nc12