Reaction Details
TargetCytoplasmic tyrosine-protein kinase BMX
LigandBDBM97672
Substrate/Competitorn/a
Meas. Tech.HotSpot kinase assay
IC50 1.1±n/a nM
Citation Honigberg, LVerner, EBuggy, JJLoury, DChen, W Inhibitors of bruton's tyrosine kinase US Patent US9181263 Publication Date 11/10/2015
 
Cytoplasmic tyrosine-protein kinase BMX
Name:Cytoplasmic tyrosine-protein kinase BMX
Type:Tyrosine-protein kinase
Mol. Mass.:78030.42
Organism:Homo sapiens (Human)
Description:P51813
Residue:675
BDBM97672
NameBDBM97672
Synonyms:US8476284, 40 US9181263, 9 | US9278100, 9
TypeSmall organic molecule
Emp. Form.C26H26N6O2
Mol. Mass.454.5236
SMILESNc1ncnc2n(nc(-c3ccc(Oc4ccccc4)cc3)c12)[C@@H]1CC[C@@H](CC1)NC(=O)C=C