Reaction Details
TargetTyrosine-protein kinase Fer
LigandBDBM97672
Substrate/Competitorn/a
Meas. Tech.HotSpot kinase assay
IC50 3346±n/a nM
Citation Honigberg, LVerner, EBuggy, JJLoury, DChen, W Inhibitors of bruton's tyrosine kinase US Patent US9181263 Publication Date 11/10/2015
 
Tyrosine-protein kinase Fer
Name:Tyrosine-protein kinase Fer
Type:Enzyme
Mol. Mass.:94643.38
Organism:Homo sapiens (Human)
Description:P16591
Residue:822
BDBM97672
NameBDBM97672
Synonyms:US8476284, 40 US9181263, 9 | US9278100, 9
TypeSmall organic molecule
Emp. Form.C26H26N6O2
Mol. Mass.454.5236
SMILESNc1ncnc2n(nc(-c3ccc(Oc4ccccc4)cc3)c12)[C@@H]1CC[C@@H](CC1)NC(=O)C=C