Reaction Details
TargetTyrosine-protein kinase BTK
LigandBDBM50357312
Substrate/Competitorn/a
Meas. Tech.HotSpot kinase assay
IC50 0.5±n/a nM
Citation Honigberg, LVerner, EBuggy, JJLoury, DChen, W Inhibitors of bruton's tyrosine kinase US Patent US9181263 Publication Date 11/10/2015
 
Tyrosine-protein kinase BTK
Name:Tyrosine-protein kinase BTK
Type:Enzyme
Mol. Mass.:76289.95
Organism:Homo sapiens (Human)
Description:Q06187
Residue:659
BDBM50357312
NameBDBM50357312
Synonyms:IBRUTINIB US10124003, Ref. Ex. Compound 1 US10793575, Example ibrutinib US10919899, Ibrutinib US11186578, Example Ibrutinib US11407754, Example Ibrutinib US20240059694, Compound Ibrutinib US9181263, 1 | US9278100, 1
TypeSmall organic molecule
Emp. Form.C25H24N6O2
Mol. Mass.440.4971
SMILESNc1ncnc2n(nc(-c3ccc(Oc4ccccc4)cc3)c12)[C@@H]1CCCN(C1)C(=O)C=C