Reaction Details
TargetTyrosine-protein kinase BTK
LigandBDBM191623
Substrate/Competitorn/a
Meas. Tech.HotSpot kinase assay
IC50 1.58±n/a nM
Citation Honigberg, LVerner, EBuggy, JJLoury, DChen, W Inhibitors of bruton's tyrosine kinase US Patent US9181263 Publication Date 11/10/2015
 
Tyrosine-protein kinase BTK
Name:Tyrosine-protein kinase BTK
Type:Enzyme
Mol. Mass.:76289.95
Organism:Homo sapiens (Human)
Description:Q06187
Residue:659
BDBM191623
NameBDBM191623
Synonyms:US9181263, 19 | US9278100, 19
TypeSmall organic molecule
Emp. Form.C23H22N6O2
Mol. Mass.414.4598
SMILESCN(CCn1nc(-c2ccc(Oc3ccccc3)cc2)c2c(N)ncnc12)C(=O)C=C