Reaction Details
TargetTyrosine-protein kinase BTK
LigandBDBM191626
Substrate/Competitorn/a
Meas. Tech.HotSpot kinase assay
IC50 1.57±n/a nM
Citation Honigberg, LVerner, EBuggy, JJLoury, DChen, W Inhibitors of bruton's tyrosine kinase US Patent US9181263 Publication Date 11/10/2015
 
Tyrosine-protein kinase BTK
Name:Tyrosine-protein kinase BTK
Type:Enzyme
Mol. Mass.:76289.95
Organism:Homo sapiens (Human)
Description:Q06187
Residue:659
BDBM191626
NameBDBM191626
Synonyms:US9181263, 22 | US9278100, 22
TypeSmall organic molecule
Emp. Form.C27H26N6O2
Mol. Mass.466.5343
SMILESCC#CC(=O)N[C@H]1CC[C@H](CC1)n1nc(-c2ccc(Oc3ccccc3)cc2)c2c(N)ncnc12