Reaction Details
TargetEpidermal growth factor receptor
LigandBDBM191605
Substrate/Competitorn/a
Meas. Tech.HotSpot kinase assay
IC50 2.298±n/a nM
Citation Honigberg, LVerner, EBuggy, JJLoury, DChen, W Inhibitors of bruton's tyrosine kinase US Patent US9181263 Publication Date 11/10/2015
 
Epidermal growth factor receptor
Name:Epidermal growth factor receptor
Type:Receptor Kinase Domain
Mol. Mass.:134279.59
Organism:Homo sapiens (Human)
Description:P00533
Residue:1210
BDBM191605
NameBDBM191605
Synonyms:US9181263, 14 | US9278100, 14
TypeSmall organic molecule
Emp. Form.C25H24N6O2
Mol. Mass.440.4971
SMILESNc1ncnc2n(C[C@@H]3CCCN3C(=O)C=C)nc(-c3ccc(Oc4ccccc4)cc3)c12