Reaction Details
TargetTyrosine-protein kinase Lck
LigandBDBM191617
Substrate/Competitorn/a
Meas. Tech.HotSpot kinase assay
IC50 1.56±n/a nM
Citation Honigberg, LVerner, EBuggy, JJLoury, DChen, W Inhibitors of bruton's tyrosine kinase US Patent US9181263 Publication Date 11/10/2015
 
Tyrosine-protein kinase Lck
Name:Tyrosine-protein kinase Lck
Type:n/a
Mol. Mass.:57987.83
Organism:Homo sapiens (Human)
Description:P06239
Residue:509
BDBM191617
NameBDBM191617
Synonyms:US9181263, 13 | US9278100, 13
TypeSmall organic molecule
Emp. Form.C25H24N6O2
Mol. Mass.440.4971
SMILESNc1ncnc2n(C[C@H]3CCCN3C(=O)C=C)nc(-c3ccc(Oc4ccccc4)cc3)c12