Reaction Details
TargetTyrosine-protein kinase Lck
LigandBDBM191622
Substrate/Competitorn/a
Meas. Tech.HotSpot kinase assay
IC50 0.76±n/a nM
Citation Honigberg, LVerner, EBuggy, JJLoury, DChen, W Inhibitors of bruton's tyrosine kinase US Patent US9181263 Publication Date 11/10/2015
 
Tyrosine-protein kinase Lck
Name:Tyrosine-protein kinase Lck
Type:n/a
Mol. Mass.:57987.83
Organism:Homo sapiens (Human)
Description:P06239
Residue:509
BDBM191622
NameBDBM191622
Synonyms:US9181263, 18
TypeSmall organic molecule
Emp. Form.C29H33N7O2
Mol. Mass.511.618
SMILESCN(C)C\C=C\C(=O)N[C@H]1CC[C@@H](CC1)n1nc(-c2ccc(Oc3ccccc3)cc2)c2c(N)ncnc12