Reaction Details
TargetTyrosine-protein kinase JAK3
LigandBDBM191617
Substrate/Competitorn/a
Meas. Tech.HotSpot kinase assay
IC50 12980±n/a nM
Citation Honigberg, LVerner, EBuggy, JJLoury, DChen, W Inhibitors of bruton's tyrosine kinase US Patent US9181263 Publication Date 11/10/2015
 
Tyrosine-protein kinase JAK3
Name:Tyrosine-protein kinase JAK3
Type:Protein
Mol. Mass.:125111.08
Organism:Homo sapiens (Human)
Description:P52333
Residue:1124
BDBM191617
NameBDBM191617
Synonyms:US9181263, 13 | US9278100, 13
TypeSmall organic molecule
Emp. Form.C25H24N6O2
Mol. Mass.440.4971
SMILESNc1ncnc2n(C[C@H]3CCCN3C(=O)C=C)nc(-c3ccc(Oc4ccccc4)cc3)c12