Reaction Details
TargetSerine protease hepsin
LigandBDBM50069104
Substrate/Competitorn/a
Meas. Tech.High-Throughput Screening Assay
IC50 350±120 nM
Citation Vasioukhin, VIChevillet, JR Hepsin inhibitors US Patent US9182402 Publication Date 11/10/2015
 
Serine protease hepsin
Name:Serine protease hepsin
Type:Enzyme
Mol. Mass.:45016.98
Organism:Homo sapiens (Human)
Description:Human deglycosylated hepsin was expressed in Pichia pastoris.
Residue:417
BDBM50069104
NameBDBM50069104
Synonyms:CHEMBL1449583 | US9182402, 4
TypeSmall organic molecule
Emp. Form.C18H16N2
Mol. Mass.260.333
SMILESCc1cccc(c1)C1Nc2cccc3cccc(N1)c23