Reaction Details
TargetCytochrome b
LigandBDBM192013
Substrate/Competitorn/a
Meas. Tech.Cytochrome b Enzyme Assay
pH7.4±n/a
Temperature298.15±n/a K
IC50 26±n/a nM
Commentsextracted
Citation Vincent, BMLanglois, JBSrinivas, RLancaster, AKScherz-Shouval, RWhitesell, LTidor, BBuchwald, SLLindquist, S A Fungal-Selective Cytochrome bc1 Inhibitor Impairs Virulence and Prevents the Evolution of Drug Resistance. Cell Chem Biol23:978-991 (2016) 
 
Cytochrome b
Name:Cytochrome b
Synonyms:n/a
Type:Protein
Mol. Mass.:43717.83
Organism:Candida albicans (Yeast)
Description:n/a
Residue:387
BDBM192013
NameBDBM192013
Synonyms:Inz-4
TypeSmall organic molecule
Emp. Form.C18H14F4N2O2
Mol. Mass.366.3096
SMILESCOC(=O)Cn1nc(-c2cc(ccc2F)C(F)(F)F)c2cccc(C)c12