Reaction Details
TargetCytochrome b
LigandBDBM192054
Substrate/Competitorn/a
Meas. Tech.Cytochrome b Enzyme Assay
pH7.4±n/a
Temperature298.15±n/a K
IC50 66.28±n/a nM
Commentsextracted
Citation Vincent, BMLanglois, JBSrinivas, RLancaster, AKScherz-Shouval, RWhitesell, LTidor, BBuchwald, SLLindquist, S A Fungal-Selective Cytochrome bc1 Inhibitor Impairs Virulence and Prevents the Evolution of Drug Resistance. Cell Chem Biol23:978-991 (2016) 
 
Cytochrome b
Name:Cytochrome b
Synonyms:n/a
Type:Protein
Mol. Mass.:43717.83
Organism:Candida albicans (Yeast)
Description:n/a
Residue:387
BDBM192054
NameBDBM192054
Synonyms:Inz-45
TypeSmall organic molecule
Emp. Form.C24H22N2O2
Mol. Mass.370.4437
SMILESCOC(=O)Cn1nc(-c2cccc(CCc3ccccc3)c2)c2ccccc12