Reaction Details
TargetLipoxygenase
LigandBDBM192701
Substrate/Competitorn/a
Meas. Tech.In-vitro LOX Inhibition Assay
pH9±n/a
Temperature298.15±n/a K
IC50 3.239±0.575 nM
Commentsextracted
Citation Srivastava, PVyas, VKVariya, BPatel, PQureshi, GGhate, M Synthesis, anti-inflammatory, analgesic, 5-lipoxygenase (5-LOX) inhibition activities, and molecular docking study of 7-substituted coumarin derivatives. Bioorg Chem67:130-8 (2016) 
 
Lipoxygenase
Name:Lipoxygenase
Synonyms:5-Lipoxygenase (5-LOX)
Type:Protein
Mol. Mass.:97266.07
Organism:Glycine max (Soybean)
Description:n/a
Residue:866
BDBM192701
NameBDBM192701
Synonyms:7-(2-hydroxy-3-(6-nitrobenzo[d]thiazol-2-ylamino)propoxy)-4-methyl-2H-chromen-2-one (31)
TypeSmall organic molecule
Emp. Form.C20H17N3O6S
Mol. Mass.427.43
SMILESCc1cc(=O)oc2cc(OCC(O)CNc3nc4ccc(cc4s3)[N+]([O-])=O)ccc12