Reaction Details
TargetPresenilin-1
LigandBDBM193067
Substrate/Competitorn/a
Meas. Tech.Cell-Based Assay
Temperature310.15±n/a K
IC50 5.48±n/a nM
Commentsextracted
Citation Pettersson, MYJohnson, DSSubramanyam, CO'Donnell, CJam Ende, CWGreen, MEPatel, NCStiff, CMTran, TPKauffman, GWStepan, AFVerhoest, PR Substituted pyrido[1,2-a]pyrazines for the treatment of neurodegenerative and neurological disorders US Patent US9193726 Publication Date 11/24/2015
 
Presenilin-1
Name:Presenilin-1
Type:n/a
Mol. Mass.:52657.13
Organism:Homo sapiens (Human)
Description:P49768
Residue:467
BDBM193067
NameBDBM193067
Synonyms:US9193726, 55
TypeSmall organic molecule
Emp. Form.C24H23ClF2N4O3
Mol. Mass.488.914
SMILESC[C@@H]([C@@H]1CC[C@@H](O1)c1cc(F)c(Cl)c(F)c1)N1CCn2c(ccc(-n3cnc(C)c3)c2=O)C1=O