Reaction Details
TargetcAMP and cAMP-inhibited cGMP 3',5'-cyclic phosphodiesterase 10A
LigandBDBM194404
Substrate/Competitorn/a
Meas. Tech.Diaxonhit Phosphodiesterase Assay
pH7.4±n/a
Temperature310.15±n/a K
IC50 8.3±n/a nM
Commentsextracted
Citation Leblond, BTaverne, TChauvignac, CBeausoleil, ECasagrande, ADesire, LPando, MPDonello, JEYang, R Substituted 6, 7-dialkoxy-3-isoquinoline derivatives as inhibitors of phosphodiesterase 10 (PDE 10A) US Patent US9200016 Publication Date 12/1/2015
 
cAMP and cAMP-inhibited cGMP 3',5'-cyclic phosphodiesterase 10A
Name:cAMP and cAMP-inhibited cGMP 3',5'-cyclic phosphodiesterase 10A
Type:Protein
Mol. Mass.:88412.52
Organism:Homo sapiens (Human)
Description:Q9Y233
Residue:1055
BDBM194404
NameBDBM194404
Synonyms:US9200016, 86 | US9902710, Compound 86
TypeSmall organic molecule
Emp. Form.C24H25N3O4S
Mol. Mass.451.538
SMILESCCc1ncc(Cc2ccc3cccc(NS(C)(=O)=O)c3n2)c2cc(OC)c(OC)cc12