Reaction Details
TargetcAMP and cAMP-inhibited cGMP 3',5'-cyclic phosphodiesterase 10A
LigandBDBM194425
Substrate/Competitorn/a
Meas. Tech.Diaxonhit Phosphodiesterase Assay
pH7.4±n/a
Temperature310.15±n/a K
IC50 7.8±n/a nM
Commentsextracted
Citation Leblond, BTaverne, TChauvignac, CBeausoleil, ECasagrande, ADesire, LPando, MPDonello, JEYang, R Substituted 6, 7-dialkoxy-3-isoquinoline derivatives as inhibitors of phosphodiesterase 10 (PDE 10A) US Patent US9200016 Publication Date 12/1/2015
 
cAMP and cAMP-inhibited cGMP 3',5'-cyclic phosphodiesterase 10A
Name:cAMP and cAMP-inhibited cGMP 3',5'-cyclic phosphodiesterase 10A
Type:Protein
Mol. Mass.:88412.52
Organism:Homo sapiens (Human)
Description:Q9Y233
Residue:1055
BDBM194425
NameBDBM194425
Synonyms:US9200016, 107 | US9902710, Compound 107
TypeSmall organic molecule
Emp. Form.C21H20N2O4
Mol. Mass.364.3945
SMILESCCn1c2cc(Cc3cncc4cc(OC)c(OC)cc34)ccc2oc1=O