Reaction Details
TargetcAMP and cAMP-inhibited cGMP 3',5'-cyclic phosphodiesterase 10A
LigandBDBM194479
Substrate/Competitorn/a
Meas. Tech.Diaxonhit Phosphodiesterase Assay
pH7.4±n/a
Temperature310.15±n/a K
IC50 6±n/a nM
Commentsextracted
Citation Leblond, BTaverne, TChauvignac, CBeausoleil, ECasagrande, ADesire, LPando, MPDonello, JEYang, R Substituted 6, 7-dialkoxy-3-isoquinoline derivatives as inhibitors of phosphodiesterase 10 (PDE 10A) US Patent US9200016 Publication Date 12/1/2015
 
cAMP and cAMP-inhibited cGMP 3',5'-cyclic phosphodiesterase 10A
Name:cAMP and cAMP-inhibited cGMP 3',5'-cyclic phosphodiesterase 10A
Type:Protein
Mol. Mass.:88412.52
Organism:Homo sapiens (Human)
Description:Q9Y233
Residue:1055
BDBM194479
NameBDBM194479
Synonyms:US9200016, 161 | US9902710, Compound 161
TypeSmall organic molecule
Emp. Form.C22H17F3N2O3
Mol. Mass.414.3772
SMILESCOc1cc2cncc(Cc3cnc4ccc(O)c(c4c3)C(F)(F)F)c2cc1OC