Reaction Details
TargetTransitional endoplasmic reticulum ATPase
LigandBDBM194631
Substrate/Competitorn/a
Meas. Tech.Inhibition Assay
pH8±n/a
Temperature310.15±n/a K
IC50 257±n/a nM
Commentsextracted
Citation Kakizuka, AHori, SIkeda, HYoshimura, NNakano, NShudo, TFuchigami, T Agent for treatment of eye diseases US Patent US9206129 Publication Date 12/8/2015
 
Transitional endoplasmic reticulum ATPase
Name:Transitional endoplasmic reticulum ATPase
Type:Protein
Mol. Mass.:89300.63
Organism:Mus musculus (Mouse)
Description:Q01853
Residue:806
BDBM194631
NameBDBM194631
Synonyms:US9206129, 47
TypeSmall organic molecule
Emp. Form.C28H21N4NaO3S
Mol. Mass.516.546
SMILESCc1ccc(-c2ccccc2)c(c1)-c1ccc(cn1)\N=N\c1cc(c2ccccc2c1N)S(=O)(=O)O[Na]