Reaction Details
TargetDNA polymerase
LigandBDBM196149
Substrate/Competitorn/a
Meas. Tech.Inhibition Assay
pH7.4±n/a
Temperature310.15±n/a K
IC50 131000±n/a nM
Commentsextracted
Citation Ricciardi, RP Therapeutic compounds for blocking DNA synthesis of POX viruses US Patent US9211296 Publication Date 12/15/2015
 
DNA polymerase
Name:DNA polymerase
Type:Enzyme
Mol. Mass.:116939.47
Organism:Vaccinia virus (strain WR)
Description:P06856
Residue:1006
BDBM196149
NameBDBM196149
Synonyms:US9211296, Table 6, 3
TypeSmall organic molecule
Emp. Form.C17H15N5
Mol. Mass.289.3345
SMILESCCn1c2ccccc2c2ccc(\C=N\n3cnnc3)cc12