Reaction Details
TargetDNA polymerase
LigandBDBM196154
Substrate/Competitorn/a
Meas. Tech.Inhibition Assay
pH7.4±n/a
Temperature310.15±n/a K
IC50 52000±n/a nM
Commentsextracted
Citation Ricciardi, RP Therapeutic compounds for blocking DNA synthesis of POX viruses US Patent US9211296 Publication Date 12/15/2015
 
DNA polymerase
Name:DNA polymerase
Type:Enzyme
Mol. Mass.:116939.47
Organism:Vaccinia virus (strain WR)
Description:P06856
Residue:1006
BDBM196154
NameBDBM196154
Synonyms:US9211296, Table 6, 8
TypeSmall organic molecule
Emp. Form.C17H12Cl2N2O3S
Mol. Mass.395.26
SMILESCc1cc(OC(=O)c2ccco2)nc(SCc2c(Cl)cccc2Cl)n1