Reaction Details
TargetDNA polymerase
LigandBDBM196155
Substrate/Competitorn/a
Meas. Tech.Inhibition Assay
pH7.4±n/a
Temperature310.15±n/a K
IC50 26000±n/a nM
Commentsextracted
Citation Ricciardi, RP Therapeutic compounds for blocking DNA synthesis of POX viruses US Patent US9211296 Publication Date 12/15/2015
 
DNA polymerase
Name:DNA polymerase
Type:Enzyme
Mol. Mass.:116939.47
Organism:Vaccinia virus (strain WR)
Description:P06856
Residue:1006
BDBM196155
NameBDBM196155
Synonyms:US9211296, Table 6, 9
TypeSmall organic molecule
Emp. Form.C22H17NO4
Mol. Mass.359.3747
SMILESOC(=O)c1ccccc1NC(=O)OCC1c2ccccc2-c2ccccc12