Reaction Details
TargetDNA polymerase
LigandBDBM196159
Substrate/Competitorn/a
Meas. Tech.Inhibition Assay
pH7.4±n/a
Temperature310.15±n/a K
IC50 46000±n/a nM
Commentsextracted
Citation Ricciardi, RP Therapeutic compounds for blocking DNA synthesis of POX viruses US Patent US9211296 Publication Date 12/15/2015
 
DNA polymerase
Name:DNA polymerase
Type:Enzyme
Mol. Mass.:116939.47
Organism:Vaccinia virus (strain WR)
Description:P06856
Residue:1006
BDBM196159
NameBDBM196159
Synonyms:US9211296, Table 6, 13
TypeSmall organic molecule
Emp. Form.C16H10ClN3O2
Mol. Mass.311.723
SMILESOC(=O)Cn1c2ccc(Cl)cc2c2nc3ccccc3nc12