Reaction Details
TargetDNA polymerase
LigandBDBM69679
Substrate/Competitorn/a
Meas. Tech.Inhibition Assay
pH7.4±n/a
Temperature310.15±n/a K
IC50 5400±n/a nM
Commentsextracted
Citation Ricciardi, RP Therapeutic compounds for blocking DNA synthesis of POX viruses US Patent US9211296 Publication Date 12/15/2015
 
DNA polymerase
Name:DNA polymerase
Type:Enzyme
Mol. Mass.:116939.47
Organism:Vaccinia virus (strain WR)
Description:P06856
Residue:1006
BDBM69679
NameBDBM69679
Synonyms:Dimethyl-(2-phenanthro[3,4-d][1,3]dioxol-5-yl-ethyl)-amine N,N-dimethyl-2-(5-naphtho[2,1-g][1,3]benzodioxolyl)ethanamine;hydrochloride N,N-dimethyl-2-naphtho[2,1-g][1,3]benzodioxol-5-ylethanamine;hydrochloride US9211296, Table 7, Compd: 10 dimethyl(2-naphtho[2,1-g][1,3]benzodioxol-5-ylethyl)amine;hydrochloride
TypeSmall organic molecule
Emp. Form.C19H19NO2
Mol. Mass.293.3597
SMILESCN(C)CCc1cc2OCOc2c2c1ccc1ccccc21