Reaction Details
TargetDNA polymerase
LigandBDBM196139
Substrate/Competitorn/a
Meas. Tech.Inhibition Assay
pH7.4±n/a
Temperature310.15±n/a K
IC50 6000±n/a nM
Commentsextracted
Citation Ricciardi, RP Therapeutic compounds for blocking DNA synthesis of POX viruses US Patent US9211296 Publication Date 12/15/2015
 
DNA polymerase
Name:DNA polymerase
Type:Enzyme
Mol. Mass.:116939.47
Organism:Vaccinia virus (strain WR)
Description:P06856
Residue:1006
BDBM196139
NameBDBM196139
Synonyms:US9211296, Table 7, Compd: 12
TypeSmall organic molecule
Emp. Form.C21H25N3
Mol. Mass.319.4433
SMILESCc1cc(NCCN2CCCCC2)c2ccc3ccccc3c2n1