Reaction Details
TargetDNA polymerase
LigandBDBM196142
Substrate/Competitorn/a
Meas. Tech.Inhibition Assay
pH7.4±n/a
Temperature310.15±n/a K
IC50 7300±n/a nM
Commentsextracted
Citation Ricciardi, RP Therapeutic compounds for blocking DNA synthesis of POX viruses US Patent US9211296 Publication Date 12/15/2015
 
DNA polymerase
Name:DNA polymerase
Type:Enzyme
Mol. Mass.:116939.47
Organism:Vaccinia virus (strain WR)
Description:P06856
Residue:1006
BDBM196142
NameBDBM196142
Synonyms:US9211296, Table 7, Compd: 15
TypeSmall organic molecule
Emp. Form.C24H28N6
Mol. Mass.400.5193
SMILESCC1CCCC(C)N1CCNc1nc2ccccc2c2nc(nn12)-c1ccccc1