Reaction Details
TargetDNA polymerase
LigandBDBM196146
Substrate/Competitorn/a
Meas. Tech.Inhibition Assay
pH7.4±n/a
Temperature310.15±n/a K
IC50 10000±n/a nM
Commentsextracted
Citation Ricciardi, RP Therapeutic compounds for blocking DNA synthesis of POX viruses US Patent US9211296 Publication Date 12/15/2015
 
DNA polymerase
Name:DNA polymerase
Type:Enzyme
Mol. Mass.:116939.47
Organism:Vaccinia virus (strain WR)
Description:P06856
Residue:1006
BDBM196146
NameBDBM196146
Synonyms:US9211296, Table 7, Compd: 19
TypeSmall organic molecule
Emp. Form.C22H22ClN3O2S
Mol. Mass.427.947
SMILESCN(C)CCN(Cc1ccco1)C(=O)c1cc2c(Cl)nc3ccc(C)cc3c2s1