Reaction Details
TargetProstaglandin D2 receptor 2
LigandBDBM196940
Substrate/Competitorn/a
Meas. Tech.Radioligand Binding Assay
pH7.4±n/a
Ki 0.8±n/a nM
Commentsextracted
Citation Martyres, DAnderskewitz, RHoenke, CKriegl, JOost, TRist, WSeither, P Pyrazole compounds as CRTH2 antagonists US Patent US9206164 Publication Date 12/8/2015
 
Prostaglandin D2 receptor 2
Name:Prostaglandin D2 receptor 2
Type:Enzyme
Mol. Mass.:43295.45
Organism:Homo sapiens (Human)
Description:Q9Y5Y4
Residue:395
BDBM196940
NameBDBM196940
Synonyms:US9206164, 1
TypeSmall organic molecule
Emp. Form.C22H20ClN3O2
Mol. Mass.393.866
SMILESCc1nn(Cc2ccc(cc2)-c2cc3ccc(Cl)cc3[nH]2)c(C)c1CC(O)=O