Reaction Details
TargetProstaglandin D2 receptor 2
LigandBDBM196944
Substrate/Competitorn/a
Meas. Tech.Radioligand Binding Assay
pH7.4±n/a
Ki 0.5±n/a nM
Commentsextracted
Citation Martyres, DAnderskewitz, RHoenke, CKriegl, JOost, TRist, WSeither, P Pyrazole compounds as CRTH2 antagonists US Patent US9206164 Publication Date 12/8/2015
 
Prostaglandin D2 receptor 2
Name:Prostaglandin D2 receptor 2
Type:Enzyme
Mol. Mass.:43295.45
Organism:Homo sapiens (Human)
Description:Q9Y5Y4
Residue:395
BDBM196944
NameBDBM196944
Synonyms:US9206164, 5
TypeSmall organic molecule
Emp. Form.C23H19F4N3O2
Mol. Mass.445.4095
SMILESCc1nn(Cc2ccc(cc2F)-c2cc3ccc(cc3[nH]2)C(F)(F)F)c(C)c1CC(O)=O