Reaction Details
TargetProstaglandin D2 receptor 2
LigandBDBM196956
Substrate/Competitorn/a
Meas. Tech.Radioligand Binding Assay
pH7.4±n/a
Ki 0.2±n/a nM
Commentsextracted
Citation Martyres, DAnderskewitz, RHoenke, CKriegl, JOost, TRist, WSeither, P Pyrazole compounds as CRTH2 antagonists US Patent US9206164 Publication Date 12/8/2015
 
Prostaglandin D2 receptor 2
Name:Prostaglandin D2 receptor 2
Type:Enzyme
Mol. Mass.:43295.45
Organism:Homo sapiens (Human)
Description:Q9Y5Y4
Residue:395
BDBM196956
NameBDBM196956
Synonyms:US9206164, 20
TypeSmall organic molecule
Emp. Form.C24H23F3N4O2
Mol. Mass.456.4602
SMILESCCc1nn(Cc2ccc(cc2)-c2nc3ccc(cc3[nH]2)C(F)(F)F)c(CC)c1CC(O)=O