Reaction Details
TargetProstaglandin D2 receptor 2
LigandBDBM196968
Substrate/Competitorn/a
Meas. Tech.Radioligand Binding Assay
pH7.4±n/a
Ki 1.2±n/a nM
Commentsextracted
Citation Martyres, DAnderskewitz, RHoenke, CKriegl, JOost, TRist, WSeither, P Pyrazole compounds as CRTH2 antagonists US Patent US9206164 Publication Date 12/8/2015
 
Prostaglandin D2 receptor 2
Name:Prostaglandin D2 receptor 2
Type:Enzyme
Mol. Mass.:43295.45
Organism:Homo sapiens (Human)
Description:Q9Y5Y4
Residue:395
BDBM196968
NameBDBM196968
Synonyms:US9206164, 32
TypeSmall organic molecule
Emp. Form.C21H19BrN4O2
Mol. Mass.439.305
SMILESCc1nn(Cc2ccc(cc2)-c2nc3cc(Br)ccc3[nH]2)c(C)c1CC(O)=O