Reaction Details
TargetProstaglandin D2 receptor 2
LigandBDBM196990
Substrate/Competitorn/a
Meas. Tech.Radioligand Binding Assay
pH7.4±n/a
Ki 1.1±n/a nM
Commentsextracted
Citation Martyres, DAnderskewitz, RHoenke, CKriegl, JOost, TRist, WSeither, P Pyrazole compounds as CRTH2 antagonists US Patent US9206164 Publication Date 12/8/2015
 
Prostaglandin D2 receptor 2
Name:Prostaglandin D2 receptor 2
Type:Enzyme
Mol. Mass.:43295.45
Organism:Homo sapiens (Human)
Description:Q9Y5Y4
Residue:395
BDBM196990
NameBDBM196990
Synonyms:US9206164, 54
TypeSmall organic molecule
Emp. Form.C22H21ClN4O2
Mol. Mass.408.881
SMILESCc1nn(Cc2ccc(cc2)-c2nc3cc(C)c(Cl)cc3[nH]2)c(C)c1CC(O)=O