Reaction Details
TargetProstaglandin D2 receptor 2
LigandBDBM197028
Substrate/Competitorn/a
Meas. Tech.Radioligand Binding Assay
pH7.4±n/a
Ki 0.7±n/a nM
Commentsextracted
Citation Martyres, DAnderskewitz, RHoenke, CKriegl, JOost, TRist, WSeither, P Pyrazole compounds as CRTH2 antagonists US Patent US9206164 Publication Date 12/8/2015
 
Prostaglandin D2 receptor 2
Name:Prostaglandin D2 receptor 2
Type:Enzyme
Mol. Mass.:43295.45
Organism:Homo sapiens (Human)
Description:Q9Y5Y4
Residue:395
BDBM197028
NameBDBM197028
Synonyms:US9206164, 92
TypeSmall organic molecule
Emp. Form.C21H20FN5O3
Mol. Mass.409.4136
SMILESCOc1ccc2[nH]c(nc2n1)-c1ccc(Cn2nc(C)c(CC(O)=O)c2C)c(F)c1