Reaction Details
TargetProstaglandin D2 receptor 2
LigandBDBM197037
Substrate/Competitorn/a
Meas. Tech.Radioligand Binding Assay
pH7.4±n/a
Ki 1.1±n/a nM
Commentsextracted
Citation Martyres, DAnderskewitz, RHoenke, CKriegl, JOost, TRist, WSeither, P Pyrazole compounds as CRTH2 antagonists US Patent US9206164 Publication Date 12/8/2015
 
Prostaglandin D2 receptor 2
Name:Prostaglandin D2 receptor 2
Type:Enzyme
Mol. Mass.:43295.45
Organism:Homo sapiens (Human)
Description:Q9Y5Y4
Residue:395
BDBM197037
NameBDBM197037
Synonyms:US9206164, 101
TypeSmall organic molecule
Emp. Form.C23H21F3N4O2
Mol. Mass.442.4336
SMILESCCc1nn(Cc2ccc(cc2F)-c2nc3c(F)cc(F)cc3[nH]2)c(CC)c1CC(O)=O