Reaction Details
TargetLeucine-rich repeat serine/threonine-protein kinase 2
LigandBDBM196761
Substrate/Competitorn/a
Meas. Tech.Lanthascreen Binding Assay
Ki 2.8±n/a nM
Citation Baker-Glenn, CBurdick, DJChan, BKChambers, MChen, HEstrada, ASweeney, ZK Pyrazole aminopyrimidine derivatives as LRRK2 modulators US Patent US9212173 Publication Date 12/15/2015
 
Leucine-rich repeat serine/threonine-protein kinase 2
Name:Leucine-rich repeat serine/threonine-protein kinase 2
Type:Protein
Mol. Mass.:286113.20
Organism:Homo sapiens (Human)
Description:Q5S007
Residue:2527
BDBM196761
NameBDBM196761
Synonyms:US9212173, 39
TypeSmall organic molecule
Emp. Form.C15H18F4N6O
Mol. Mass.374.3366
SMILESCNc1nc(Nc2cnn(C3CCOC[C@H]3F)c2C)ncc1C(F)(F)F