Reaction Details
TargetLeucine-rich repeat serine/threonine-protein kinase 2
LigandBDBM196764
Substrate/Competitorn/a
Meas. Tech.Lanthascreen Binding Assay
Ki 4.1±n/a nM
Citation Baker-Glenn, CBurdick, DJChan, BKChambers, MChen, HEstrada, ASweeney, ZK Pyrazole aminopyrimidine derivatives as LRRK2 modulators US Patent US9212173 Publication Date 12/15/2015
 
Leucine-rich repeat serine/threonine-protein kinase 2
Name:Leucine-rich repeat serine/threonine-protein kinase 2
Type:Protein
Mol. Mass.:286113.20
Organism:Homo sapiens (Human)
Description:Q5S007
Residue:2527
BDBM196764
NameBDBM196764
Synonyms:US9212173, 42
TypeSmall organic molecule
Emp. Form.C15H18F3N7
Mol. Mass.353.3455
SMILESCCC(Cn1cc(Nc2ncc(c(NC)n2)C(F)(F)F)c(C)n1)C#N