Reaction Details
TargetLeucine-rich repeat serine/threonine-protein kinase 2
LigandBDBM196771
Substrate/Competitorn/a
Meas. Tech.Lanthascreen Binding Assay
Ki 24.5±n/a nM
Citation Baker-Glenn, CBurdick, DJChan, BKChambers, MChen, HEstrada, ASweeney, ZK Pyrazole aminopyrimidine derivatives as LRRK2 modulators US Patent US9212173 Publication Date 12/15/2015
 
Leucine-rich repeat serine/threonine-protein kinase 2
Name:Leucine-rich repeat serine/threonine-protein kinase 2
Type:Protein
Mol. Mass.:286113.20
Organism:Homo sapiens (Human)
Description:Q5S007
Residue:2527
BDBM196771
NameBDBM196771
Synonyms:US9212173, 50
TypeSmall organic molecule
Emp. Form.C12H12F3N7
Mol. Mass.311.2658
SMILESCCNc1nc(Nc2cc(nn2C)C#N)ncc1C(F)(F)F