Reaction Details
TargetMetabotropic glutamate receptor 4
LigandBDBM196919
Substrate/Competitorn/a
Meas. Tech.Pharmacological Assay
EC50 7600±2000 nM
Citation Acher, FPin, JGoudet, CEschalier, ABusserolles, JRigault, DLemasson, ICesarini, SCommare, B Hypophosphorous acid derivatives having antihyperalgic activity and biological applications thereof US Patent US9212196 Publication Date 12/15/2015
 
Metabotropic glutamate receptor 4
Name:Metabotropic glutamate receptor 4
Type:Enzyme
Mol. Mass.:101849.79
Organism:Rattus norvegicus (Rat)
Description:P31423
Residue:912
BDBM196919
NameBDBM196919
Synonyms:US9212196, Derivative 15
TypeSmall organic molecule
Emp. Form.C13H18NO8P
Mol. Mass.347.2577
SMILESN[C@H](CCP(O)(=O)C(O)c1cccc(OCC(O)=O)c1)C(O)=O