Reaction Details
TargetMetabotropic glutamate receptor 4
LigandBDBM196928
Substrate/Competitorn/a
Meas. Tech.Pharmacological Assay
EC50 260±70 nM
Citation Acher, FPin, JGoudet, CEschalier, ABusserolles, JRigault, DLemasson, ICesarini, SCommare, B Hypophosphorous acid derivatives having antihyperalgic activity and biological applications thereof US Patent US9212196 Publication Date 12/15/2015
 
Metabotropic glutamate receptor 4
Name:Metabotropic glutamate receptor 4
Type:Enzyme
Mol. Mass.:101849.79
Organism:Rattus norvegicus (Rat)
Description:P31423
Residue:912
BDBM196928
NameBDBM196928
Synonyms:US9212196, Derivative 24
TypeSmall organic molecule
Emp. Form.C13H17N2O10P
Mol. Mass.392.2552
SMILESN[C@H](CCP(O)(=O)C(O)c1ccc(OCC(O)=O)c(c1)[N+]([O-])=O)C(O)=O