Reaction Details
TargetMetabotropic glutamate receptor 4
LigandBDBM196938
Substrate/Competitorn/a
Meas. Tech.Pharmacological Assay
EC50 3090±620 nM
Citation Acher, FPin, JGoudet, CEschalier, ABusserolles, JRigault, DLemasson, ICesarini, SCommare, B Hypophosphorous acid derivatives having antihyperalgic activity and biological applications thereof US Patent US9212196 Publication Date 12/15/2015
 
Metabotropic glutamate receptor 4
Name:Metabotropic glutamate receptor 4
Type:Enzyme
Mol. Mass.:101849.79
Organism:Rattus norvegicus (Rat)
Description:P31423
Residue:912
BDBM196938
NameBDBM196938
Synonyms:US9212196, Derivative 34
TypeSmall organic molecule
Emp. Form.C14H19FNO8P
Mol. Mass.379.2747
SMILESCOc1cc(CP(O)(=O)CC[C@@H](N)C(O)=O)cc(F)c1OCC(O)=O