Reaction Details
TargetMetabotropic glutamate receptor 8
LigandBDBM196915
Substrate/Competitorn/a
Meas. Tech.Pharmacological Assay
EC50 49000±22000 nM
Citation Acher, FPin, JGoudet, CEschalier, ABusserolles, JRigault, DLemasson, ICesarini, SCommare, B Hypophosphorous acid derivatives having antihyperalgic activity and biological applications thereof US Patent US9212196 Publication Date 12/15/2015
 
Metabotropic glutamate receptor 8
Name:Metabotropic glutamate receptor 8
Type:Enzyme
Mol. Mass.:101886.18
Organism:Rattus norvegicus (Rat)
Description:P70579
Residue:908
BDBM196915
NameBDBM196915
Synonyms:US9212196, Derivative 11
TypeSmall organic molecule
Emp. Form.C14H18NO7P
Mol. Mass.343.269
SMILESN[C@H](CCP(O)(=O)C(O)c1ccc(\C=C\C(O)=O)cc1)C(O)=O