Reaction Details
TargetMetabotropic glutamate receptor 8
LigandBDBM196919
Substrate/Competitorn/a
Meas. Tech.Pharmacological Assay
EC50 71000±25000 nM
Citation Acher, FPin, JGoudet, CEschalier, ABusserolles, JRigault, DLemasson, ICesarini, SCommare, B Hypophosphorous acid derivatives having antihyperalgic activity and biological applications thereof US Patent US9212196 Publication Date 12/15/2015
 
Metabotropic glutamate receptor 8
Name:Metabotropic glutamate receptor 8
Type:Enzyme
Mol. Mass.:101886.18
Organism:Rattus norvegicus (Rat)
Description:P70579
Residue:908
BDBM196919
NameBDBM196919
Synonyms:US9212196, Derivative 15
TypeSmall organic molecule
Emp. Form.C13H18NO8P
Mol. Mass.347.2577
SMILESN[C@H](CCP(O)(=O)C(O)c1cccc(OCC(O)=O)c1)C(O)=O