Reaction Details
TargetMetabotropic glutamate receptor 8
LigandBDBM196925
Substrate/Competitorn/a
Meas. Tech.Pharmacological Assay
EC50 6860±1830 nM
Citation Acher, FPin, JGoudet, CEschalier, ABusserolles, JRigault, DLemasson, ICesarini, SCommare, B Hypophosphorous acid derivatives having antihyperalgic activity and biological applications thereof US Patent US9212196 Publication Date 12/15/2015
 
Metabotropic glutamate receptor 8
Name:Metabotropic glutamate receptor 8
Type:Enzyme
Mol. Mass.:101886.18
Organism:Rattus norvegicus (Rat)
Description:P70579
Residue:908
BDBM196925
NameBDBM196925
Synonyms:US9212196, Derivative 21
TypeSmall organic molecule
Emp. Form.C14H17F3NO8P
Mol. Mass.415.2557
SMILESN[C@H](CCP(O)(=O)C(O)c1ccc(OCC(O)=O)c(c1)C(F)(F)F)C(O)=O