Reaction Details
TargetMetabotropic glutamate receptor 7
LigandBDBM196912
Substrate/Competitorn/a
Meas. Tech.Pharmacological Assay
EC50 6600±1500 nM
Citation Acher, FPin, JGoudet, CEschalier, ABusserolles, JRigault, DLemasson, ICesarini, SCommare, B Hypophosphorous acid derivatives having antihyperalgic activity and biological applications thereof US Patent US9212196 Publication Date 12/15/2015
 
Metabotropic glutamate receptor 7
Name:Metabotropic glutamate receptor 7
Type:Enzyme
Mol. Mass.:102244.48
Organism:Rattus norvegicus (Rat)
Description:P35400
Residue:915
BDBM196912
NameBDBM196912
Synonyms:US9212196, Derivative 8
TypeSmall organic molecule
Emp. Form.C14H19INO9P
Mol. Mass.503.1802
SMILESCOc1cc(cc(I)c1OCC(O)=O)C(O)P(O)(=O)CC[C@@H](N)C(O)=O