Reaction Details
TargetMetabotropic glutamate receptor 7
LigandBDBM196914
Substrate/Competitorn/a
Meas. Tech.Pharmacological Assay
EC50 51600±16100 nM
Citation Acher, FPin, JGoudet, CEschalier, ABusserolles, JRigault, DLemasson, ICesarini, SCommare, B Hypophosphorous acid derivatives having antihyperalgic activity and biological applications thereof US Patent US9212196 Publication Date 12/15/2015
 
Metabotropic glutamate receptor 7
Name:Metabotropic glutamate receptor 7
Type:Enzyme
Mol. Mass.:102244.48
Organism:Rattus norvegicus (Rat)
Description:P35400
Residue:915
BDBM196914
NameBDBM196914
Synonyms:US9212196, Derivative 10
TypeSmall organic molecule
Emp. Form.C15H22NO8P
Mol. Mass.375.3108
SMILESCc1cc(cc(C)c1OCC(O)=O)C(O)P(O)(=O)CC[C@@H](N)C(O)=O