Reaction Details
TargetMetabotropic glutamate receptor 7
LigandBDBM196916
Substrate/Competitorn/a
Meas. Tech.Pharmacological Assay
EC50 37000±5000 nM
Citation Acher, FPin, JGoudet, CEschalier, ABusserolles, JRigault, DLemasson, ICesarini, SCommare, B Hypophosphorous acid derivatives having antihyperalgic activity and biological applications thereof US Patent US9212196 Publication Date 12/15/2015
 
Metabotropic glutamate receptor 7
Name:Metabotropic glutamate receptor 7
Type:Enzyme
Mol. Mass.:102244.48
Organism:Rattus norvegicus (Rat)
Description:P35400
Residue:915
BDBM196916
NameBDBM196916
Synonyms:US9212196, Derivative 12
TypeSmall organic molecule
Emp. Form.C14H20NO7P
Mol. Mass.345.2849
SMILESN[C@H](CCP(O)(=O)C(O)c1ccc(CCC(O)=O)cc1)C(O)=O