Reaction Details
TargetMetabotropic glutamate receptor 7
LigandBDBM196925
Substrate/Competitorn/a
Meas. Tech.Pharmacological Assay
EC50 35500±4000 nM
Citation Acher, FPin, JGoudet, CEschalier, ABusserolles, JRigault, DLemasson, ICesarini, SCommare, B Hypophosphorous acid derivatives having antihyperalgic activity and biological applications thereof US Patent US9212196 Publication Date 12/15/2015
 
Metabotropic glutamate receptor 7
Name:Metabotropic glutamate receptor 7
Type:Enzyme
Mol. Mass.:102244.48
Organism:Rattus norvegicus (Rat)
Description:P35400
Residue:915
BDBM196925
NameBDBM196925
Synonyms:US9212196, Derivative 21
TypeSmall organic molecule
Emp. Form.C14H17F3NO8P
Mol. Mass.415.2557
SMILESN[C@H](CCP(O)(=O)C(O)c1ccc(OCC(O)=O)c(c1)C(F)(F)F)C(O)=O