Reaction Details
TargetMetabotropic glutamate receptor 7
LigandBDBM196926
Substrate/Competitorn/a
Meas. Tech.Pharmacological Assay
EC50 15000±3600 nM
Citation Acher, FPin, JGoudet, CEschalier, ABusserolles, JRigault, DLemasson, ICesarini, SCommare, B Hypophosphorous acid derivatives having antihyperalgic activity and biological applications thereof US Patent US9212196 Publication Date 12/15/2015
 
Metabotropic glutamate receptor 7
Name:Metabotropic glutamate receptor 7
Type:Enzyme
Mol. Mass.:102244.48
Organism:Rattus norvegicus (Rat)
Description:P35400
Residue:915
BDBM196926
NameBDBM196926
Synonyms:US9212196, Derivative 22
TypeSmall organic molecule
Emp. Form.C13H18NO9P
Mol. Mass.363.2571
SMILESN[C@H](CCP(O)(=O)C(O)c1ccc(OCC(O)=O)c(O)c1)C(O)=O